УНЫНИЕ
type: LexicalConcept
association: http://lod.ruthes.org/resource/concept/118999
association1: http://lod.ruthes.org/resource/concept/151765
association2: http://lod.ruthes.org/resource/concept/133733
holonym: http://lod.ruthes.org/resource/concept/118439
hypernym: http://lod.ruthes.org/resource/concept/106661
hyponym: http://lod.ruthes.org/resource/concept/107143
hyponym: http://lod.ruthes.org/resource/concept/118430
hyponym: http://lod.ruthes.org/resource/concept/151769
definition: мрачное, подавленное состояние духа, безнадёжная печаль
in scheme: ruthes
lexicalized sense: 118438-уныние-n-0
lexicalized sense: 118438-упадническое настроение-ng-0
lexicalized sense: 118438-чувство уныния-ng-0