ТОРГОВЫЙ ЛОТОК
type: LexicalConcept
holonym: http://lod.ruthes.org/resource/concept/141035
hypernym: http://lod.ruthes.org/resource/concept/118275
definition: большой плоский ящик для торговли вразнос и для переноски товаров
in scheme: ruthes
lexicalized sense: 118642-лотковый-adj-0
lexicalized sense: 118642-лоток-n-0
lexicalized sense: 118642-лоточный-adj-0
lexicalized sense: 118642-торговый лоток-ng-0