ЧЕСТНЫЙ, ПРАВДИВЫЙ
type: LexicalConcept
hypernym: http://lod.ruthes.org/resource/concept/106924
hyponym: http://lod.ruthes.org/resource/concept/112688
hyponym: http://lod.ruthes.org/resource/concept/118057
hyponym: http://lod.ruthes.org/resource/concept/118716
hyponym: http://lod.ruthes.org/resource/concept/120986
hyponym: http://lod.ruthes.org/resource/concept/123794
definition: правдивый, склонность к высказыванию правды
in scheme: ruthes
lexicalized sense: 118717-правдивость-n-0
lexicalized sense: 118717-правдивый-adj-0
lexicalized sense: 118717-честнейший-adj-0
lexicalized sense: 118717-честность-n-0
lexicalized sense: 118717-честный-adj-0