САРКАСТИЧЕСКИЙ
type: LexicalConcept
hypernym: http://lod.ruthes.org/resource/concept/118787
hypernym: http://lod.ruthes.org/resource/concept/118789
definition: исполненный сарказма, язвительно-насмешливый
in scheme: ruthes
lexicalized sense: 118788-сарказм-n-0
lexicalized sense: 118788-саркастический-adj-0
lexicalized sense: 118788-саркастичность-n-0
lexicalized sense: 118788-саркастичный-adj-0