ПОДРОБНЫЙ, ДЕТАЛЬНЫЙ
type: LexicalConcept
association: http://lod.ruthes.org/resource/concept/119609
association2: http://lod.ruthes.org/resource/concept/117342
association2: http://lod.ruthes.org/resource/concept/126041
hypernym: http://lod.ruthes.org/resource/concept/150495
hypernym: http://lod.ruthes.org/resource/concept/150737
hyponym: http://lod.ruthes.org/resource/concept/118823
hyponym: http://lod.ruthes.org/resource/concept/119410
definition: содержащий информацию о множестве мелких деталей, частностей
in scheme: ruthes
lexicalized sense: 118822-детальнейший-adj-0
lexicalized sense: 118822-детальность-n-0
lexicalized sense: 118822-детальный-adj-0
lexicalized sense: 118822-подробнейший-adj-0
lexicalized sense: 118822-подробность-n-0
lexicalized sense: 118822-подробный-adj-0
lexicalized sense: 118822-развернутость-n-0
lexicalized sense: 118822-развернутый-adj-0