САМООТВЕРЖЕННЫЙ
type: LexicalConcept
association1: http://lod.ruthes.org/resource/concept/134717
association2: http://lod.ruthes.org/resource/concept/133772
hypernym: http://lod.ruthes.org/resource/concept/106924
hyponym: http://lod.ruthes.org/resource/concept/115167
hyponym: http://lod.ruthes.org/resource/concept/119427
hyponym: http://lod.ruthes.org/resource/concept/119428
hyponym: http://lod.ruthes.org/resource/concept/123848
hyponym: http://lod.ruthes.org/resource/concept/130861
definition: готовность жертвовать собой для блага других, для общего блага
in scheme: ruthes
lexicalized sense: 118883-жертвенность-n-0
lexicalized sense: 118883-жертвенный-adj-0
lexicalized sense: 118883-самоотверженность-n-0
lexicalized sense: 118883-самоотверженный-adj-0