РАЗГОВОРЧИВЫЙ
type: LexicalConcept
association: http://lod.ruthes.org/resource/concept/119918
hypernym: http://lod.ruthes.org/resource/concept/118454
hyponym: http://lod.ruthes.org/resource/concept/118909
definition: любящий много говорить; разговорчивый, словоохотливый
in scheme: ruthes
lexicalized sense: 118910-говорливость-n-0
lexicalized sense: 118910-говорливый-adj-0
lexicalized sense: 118910-разговорчивость-n-0
lexicalized sense: 118910-разговорчивый-adj-0
lexicalized sense: 118910-словоохотливость-n-0
lexicalized sense: 118910-словоохотливый-adj-0