ТРЕБОВАТЕЛЬНЫЙ, ВЗЫСКАТЕЛЬНЫЙ
type: LexicalConcept
association: http://lod.ruthes.org/resource/concept/132915
hypernym: http://lod.ruthes.org/resource/concept/106924
hyponym: http://lod.ruthes.org/resource/concept/118936
hyponym: http://lod.ruthes.org/resource/concept/118938
definition: настойчивый в своих требованиях; повелительный, властный
in scheme: ruthes
lexicalized sense: 118937-взыскательность-n-0
lexicalized sense: 118937-взыскательный-adj-0
lexicalized sense: 118937-требовательность-n-0
lexicalized sense: 118937-требовательный-adj-0