ВЫНОСЛИВЫЙ
type: LexicalConcept
hypernym: http://lod.ruthes.org/resource/concept/110251
hypernym: http://lod.ruthes.org/resource/concept/118991
hyponym: http://lod.ruthes.org/resource/concept/120444
hyponym: http://lod.ruthes.org/resource/concept/120548
definition: способность переносить нагрузки и неблагоприятные условия, выполнять работу итп в течение длительного времени
in scheme: ruthes
lexicalized sense: 118989-выносливость-n-0
lexicalized sense: 118989-выносливый-adj-0