ЧЕТКИЙ, ЧЕТКО ОЧЕРЧЕННЫЙ
type: LexicalConcept
association: http://lod.ruthes.org/resource/concept/128660
hypernym: http://lod.ruthes.org/resource/concept/151360
hyponym: http://lod.ruthes.org/resource/concept/118355
hyponym: http://lod.ruthes.org/resource/concept/119005
hyponym: http://lod.ruthes.org/resource/concept/119201
hyponym: http://lod.ruthes.org/resource/concept/120329
hyponym: http://lod.ruthes.org/resource/concept/121337
hyponym: http://lod.ruthes.org/resource/concept/135418
hyponym: http://lod.ruthes.org/resource/concept/153272
definition: отчётливый, хорошо видимый, слышимый, осязаемый
in scheme: ruthes
lexicalized sense: 119007-отчетливость-n-0
lexicalized sense: 119007-отчетливый-adj-0
lexicalized sense: 119007-четкий-adj-0
lexicalized sense: 119007-четко видимый-adjg-0
lexicalized sense: 119007-четко очерченный-adjg-0
lexicalized sense: 119007-четкость-n-0
lexicalized sense: 119007-явственно видимый-adjg-0
lexicalized sense: 119007-явственность-n-0
lexicalized sense: 119007-явственный-adj-0
lexicalized sense: 119007-ясно видимый-adjg-0
lexicalized sense: 119007-ясно очерченный-adjg-0
lexicalized sense: 119007-ясность-n-0
lexicalized sense: 119007-ясный-adj-0