НЕЗАБЫВАЕМЫЙ
type: LexicalConcept
association2: http://lod.ruthes.org/resource/concept/6950
holonym: http://lod.ruthes.org/resource/concept/112718
hypernym: http://lod.ruthes.org/resource/concept/118141
definition: хорошо, надолго сохраняющийся в памяти, долго помнящийся; незабываемый
in scheme: ruthes
lexicalized sense: 119063-незабвенность-n-0
lexicalized sense: 119063-незабвенный-adj-0
lexicalized sense: 119063-незабываемость-n-0
lexicalized sense: 119063-незабываемый-adj-0
lexicalized sense: 119063-незапамятный-adj-0
lexicalized sense: 119063-неизгладимость-n-0
lexicalized sense: 119063-неизгладимый-adj-0
lexicalized sense: 119063-памятный-adj-0
lexicalized sense: 119063-приснопамятный-adj-0