ОСОБЫЙ (ОТДЕЛЬНЫЙ, НЕЗАВИСИМЫЙ ОТ ДРУГИХ)
type: LexicalConcept
hypernym: http://lod.ruthes.org/resource/concept/118839
hypernym: http://lod.ruthes.org/resource/concept/119136
definition: отделённый от других, находящийся в стороне
in scheme: ruthes
lexicalized sense: 119228-особый-adj-0