ДОВОЛЬНЫЙ (ИСПЫТЫВАЮЩИЙ УДОВЛЕТВОРЕНИЕ)
type: LexicalConcept
association: http://lod.ruthes.org/resource/concept/107058
holonym: http://lod.ruthes.org/resource/concept/118667
hypernym: http://lod.ruthes.org/resource/concept/107065
hyponym: http://lod.ruthes.org/resource/concept/128990
hyponym: http://lod.ruthes.org/resource/concept/142182
definition: выражающий довольство, удовлетворение чем-либо
in scheme: ruthes
lexicalized sense: 119335-довольный-adj-0