НЕПОСРЕДСТВЕННЫЙ (ОТКРОВЕННЫЙ И НЕПРИНУЖДЕННЫЙ)
type: LexicalConcept
hypernym: http://lod.ruthes.org/resource/concept/112688
hypernym: http://lod.ruthes.org/resource/concept/119340
definition: искренность, способность действовать без раздумий и сомнений, по внутреннему влечению; также проявление этого свойства
in scheme: ruthes
lexicalized sense: 119339-непосредственность-n-0
lexicalized sense: 119339-непосредственный-adj-0