БЕЗДОКАЗАТЕЛЬНЫЙ
type: LexicalConcept
association: http://lod.ruthes.org/resource/concept/119001
association1: http://lod.ruthes.org/resource/concept/106872
hypernym: http://lod.ruthes.org/resource/concept/138204
definition: не подкреплённый доказательством; голословный
in scheme: ruthes
lexicalized sense: 119426-бездоказательность-n-0
lexicalized sense: 119426-бездоказательный-adj-0
lexicalized sense: 119426-беспочвенность-n-0
lexicalized sense: 119426-беспочвенный-adj-0
lexicalized sense: 119426-голословность-n-0
lexicalized sense: 119426-голословный-adj-0
lexicalized sense: 119426-огульность-n-0
lexicalized sense: 119426-огульный-adj-0