ГЕРОИЧЕСКИЙ
type: LexicalConcept
association2: http://lod.ruthes.org/resource/concept/136319
holonym: http://lod.ruthes.org/resource/concept/108241
holonym: http://lod.ruthes.org/resource/concept/125868
hypernym: http://lod.ruthes.org/resource/concept/118883
hyponym: http://lod.ruthes.org/resource/concept/135703
definition: демонстрирующий высшую степень смелости; свойственный герою, характерный для него
in scheme: ruthes
lexicalized sense: 119428-героический-adj-0
lexicalized sense: 119428-героичность-n-0
lexicalized sense: 119428-героичный-adj-0
lexicalized sense: 119428-геройский-adj-0