ДВОЙСТВЕННЫЙ
type: LexicalConcept
hypernym: http://lod.ruthes.org/resource/concept/119459
hypernym: http://lod.ruthes.org/resource/concept/119873
definition: проявляющийся или возможный в двух видах, в двух формах; двойной
in scheme: ruthes
lexicalized sense: 119460-двойственность-n-0
lexicalized sense: 119460-двойственный-adj-0
lexicalized sense: 119460-двоякий-adj-0
lexicalized sense: 119460-двоякость-n-0