ЖИВОПИСНЫЙ НА ВИД
type: LexicalConcept
association1: http://lod.ruthes.org/resource/concept/138419
hypernym: http://lod.ruthes.org/resource/concept/115077
definition: красивый, красочный, картинный, достойный отображения в живописи
in scheme: ruthes
lexicalized sense: 119542-живописность-n-0
lexicalized sense: 119542-живописность вида-ng-0
lexicalized sense: 119542-живописный-adj-0
lexicalized sense: 119542-живописный на вид-adjg-0