ВЫПУКЛЫЙ, РЕЛЬЕФНЫЙ
type: LexicalConcept
association: http://lod.ruthes.org/resource/concept/119604
association2: http://lod.ruthes.org/resource/concept/116997
hypernym: http://lod.ruthes.org/resource/concept/106559
definition: отчётливый, подчёркнутый, рельефный, выразительный
in scheme: ruthes
lexicalized sense: 119605-выпуклость-n-0
lexicalized sense: 119605-выпуклый-adj-0
lexicalized sense: 119605-рельефность-n-0
lexicalized sense: 119605-рельефный-adj-0