КРАТКИЙ, КРАТКО ИЗЛОЖЕННЫЙ
type: LexicalConcept
association: http://lod.ruthes.org/resource/concept/118822
holonym: http://lod.ruthes.org/resource/concept/135318
hypernym: http://lod.ruthes.org/resource/concept/150737
hyponym: http://lod.ruthes.org/resource/concept/119047
hyponym: http://lod.ruthes.org/resource/concept/125658
definition: изложенный в немногих словах, коротко; сжатый
in scheme: ruthes
lexicalized sense: 119609-компактно изложенный-adjg-0
lexicalized sense: 119609-компактность-n-0
lexicalized sense: 119609-компактный-adj-0
lexicalized sense: 119609-коротенький-adj-0
lexicalized sense: 119609-короткий-adj-0
lexicalized sense: 119609-коротко изложенный-adjg-0
lexicalized sense: 119609-кратенький-adj-0
lexicalized sense: 119609-краткий-adj-0
lexicalized sense: 119609-кратко изложенный-adjg-0
lexicalized sense: 119609-краткость-n-0
lexicalized sense: 119609-кратчайший-adj-0
lexicalized sense: 119609-лапидарность-n-0
lexicalized sense: 119609-лапидарный-adj-0
lexicalized sense: 119609-сжатость-n-0
lexicalized sense: 119609-сжатый-adj-0