ЗАМКНУТЫЙ, НЕОБЩИТЕЛЬНЫЙ
type: LexicalConcept
association: http://lod.ruthes.org/resource/concept/118454
hypernym: http://lod.ruthes.org/resource/concept/151843
hyponym: http://lod.ruthes.org/resource/concept/118305
hyponym: http://lod.ruthes.org/resource/concept/119649
hyponym: http://lod.ruthes.org/resource/concept/124580
definition: некоммуникабельный, замкнутость характера, несклонность к общению
in scheme: ruthes
lexicalized sense: 119648-закрытость-n-0
lexicalized sense: 119648-закрытый по характеру-adjg-0
lexicalized sense: 119648-замкнутость-n-0
lexicalized sense: 119648-замкнутый-adj-0
lexicalized sense: 119648-малообщительность-n-0
lexicalized sense: 119648-малообщительный-adj-0
lexicalized sense: 119648-некоммуникабельность-n-0
lexicalized sense: 119648-некоммуникабельный-adj-0
lexicalized sense: 119648-необщительность-n-0
lexicalized sense: 119648-необщительный-adj-0