БЕСПОВОРОТНЫЙ (ОКОНЧАТЕЛЬНЫЙ)
type: LexicalConcept
hypernym: http://lod.ruthes.org/resource/concept/118846
definition: такой, который не будет изменен; окончательный
in scheme: ruthes
lexicalized sense: 119659-бесповоротность-n-0
lexicalized sense: 119659-бесповоротный-adj-0