ОТЗЫВ НА ПАРОЛЬ
type: LexicalConcept
association1: http://lod.ruthes.org/resource/concept/107640
hypernym: http://lod.ruthes.org/resource/concept/106976
definition: условленный секретный ответ на пароль для отличения своих от чужих
in scheme: ruthes
lexicalized sense: 119708-отзыв-n-0
lexicalized sense: 119708-отзыв на пароль-ng-0