ВЗАИМНЫЙ
type: LexicalConcept
association2: http://lod.ruthes.org/resource/concept/1166
association2: http://lod.ruthes.org/resource/concept/123479
association2: http://lod.ruthes.org/resource/concept/137784
association2: http://lod.ruthes.org/resource/concept/146143
hypernym: http://lod.ruthes.org/resource/concept/119353
definition: проявляющийся, совершаемый, действующий по отношению друг к другу; обоюдный
in scheme: ruthes
lexicalized sense: 119849-взаимность-n-0
lexicalized sense: 119849-взаимный-adj-0
lexicalized sense: 119849-друг друга-ng-0
lexicalized sense: 119849-друг дружку-ng-0
lexicalized sense: 119849-обоюдность-n-0
lexicalized sense: 119849-обоюдный-adj-0