ГОСТЕПРИИМНЫЙ
type: LexicalConcept
association1: http://lod.ruthes.org/resource/concept/120828
hypernym: http://lod.ruthes.org/resource/concept/119866
definition: устраивающий радушный, тёплый приём; богатый угощениями; гостеприимный
in scheme: ruthes
lexicalized sense: 119867-гостеприимность-n-0
lexicalized sense: 119867-гостеприимный-adj-0
lexicalized sense: 119867-гостеприимство-n-0
lexicalized sense: 119867-хлебосольный-adj-0
lexicalized sense: 119867-хлебосольство-n-0