ИЗОЛИРОВАННЫЙ (ОТДЕЛЬНЫЙ)
type: LexicalConcept
hypernym: http://lod.ruthes.org/resource/concept/118839
hyponym: http://lod.ruthes.org/resource/concept/133477
definition: обособленный, отдельный, не связанный с другими, с окружающим
in scheme: ruthes
lexicalized sense: 119869-изолированность-n-0
lexicalized sense: 119869-изолированный-adj-0