СМЕЖНЫЙ, СОПРЕДЕЛЬНЫЙ
type: LexicalConcept
hypernym: http://lod.ruthes.org/resource/concept/119883
definition: непосредственная близость, тесное соприкосновение
in scheme: ruthes
lexicalized sense: 119884-смежность-n-0
lexicalized sense: 119884-смежный-adj-0
lexicalized sense: 119884-сопредельность-n-0
lexicalized sense: 119884-сопредельный-adj-0