ЗАБОТЛИВЫЙ
type: LexicalConcept
association1: http://lod.ruthes.org/resource/concept/118621
hypernym: http://lod.ruthes.org/resource/concept/118028
hypernym: http://lod.ruthes.org/resource/concept/118658
hypernym: http://lod.ruthes.org/resource/concept/119093
hyponym: http://lod.ruthes.org/resource/concept/120121
hyponym: http://lod.ruthes.org/resource/concept/124130
definition: проявляющий попечение, заботу, относящийся с предупредительностью, внимательный
in scheme: ruthes
lexicalized sense: 120120-заботливость-n-0
lexicalized sense: 120120-заботливый-adj-0