ЗЕМЛИСТЫЙ (СЕРОВАТО-БЛЕДНЫЙ)
type: LexicalConcept
hypernym: http://lod.ruthes.org/resource/concept/109487
hypernym: http://lod.ruthes.org/resource/concept/152622
definition: серовато-бледный цвет, напоминающий цвет земли
in scheme: ruthes
lexicalized sense: 120227-землистость-n-0
lexicalized sense: 120227-землистый-adj-0
lexicalized sense: 120227-серый-adj-0