ЗЛОЙ, НЕДОБРЫЙ
type: LexicalConcept
association: http://lod.ruthes.org/resource/concept/106656
association2: http://lod.ruthes.org/resource/concept/112925
association2: http://lod.ruthes.org/resource/concept/115819
association2: http://lod.ruthes.org/resource/concept/129474
association2: http://lod.ruthes.org/resource/concept/130868
hypernym: http://lod.ruthes.org/resource/concept/107058
definition: вызванный, пропитанный злобой, злорадством, недоброжелательностью
in scheme: ruthes
lexicalized sense: 120455-злой-adj-0
lexicalized sense: 120455-недобрый-adj-0