ПОКАЗАНИЯ ПРИБОРА
type: LexicalConcept
association1: http://lod.ruthes.org/resource/concept/106457
association1: http://lod.ruthes.org/resource/concept/3648
hypernym: http://lod.ruthes.org/resource/concept/106515
hyponym: http://lod.ruthes.org/resource/concept/117944
definition: значение, величина, показываемая измерительным прибором
in scheme: ruthes
lexicalized sense: 120457-индикация-n-0
lexicalized sense: 120457-индикация прибора-ng-0
lexicalized sense: 120457-показание-n-0
lexicalized sense: 120457-показание прибора-ng-0
lexicalized sense: 120457-показания прибора-ng-0
lexicalized sense: 120457-показать-v-0
lexicalized sense: 120457-показывать-v-0
lexicalized sense: 120457-регистрировать-v-0
lexicalized sense: 120457-регистрироваться-v-0
lexicalized sense: 120457-регистрироваться прибором-vg-0