ПОСТАВЩИК
type: LexicalConcept
holonym: http://lod.ruthes.org/resource/concept/120498
hypernym: http://lod.ruthes.org/resource/concept/140670
hypernym: http://lod.ruthes.org/resource/concept/5406
definition: лицо или учреждение, занимающееся поставками чего-либо
in scheme: ruthes
lexicalized sense: 120499-поставщик-n-0