СМЕНА (РАБОЧЕЕ ВРЕМЯ)
type: LexicalConcept
association2: http://lod.ruthes.org/resource/concept/120633
association2: http://lod.ruthes.org/resource/concept/137140
holonym: http://lod.ruthes.org/resource/concept/135125
hypernym: http://lod.ruthes.org/resource/concept/1495
hyponym: http://lod.ruthes.org/resource/concept/154124
definition: промежуток времени, по истечении которого одна группа работающих на предприятии замещает другую
in scheme: ruthes
lexicalized sense: 120632-рабочая смена-ng-0
lexicalized sense: 120632-смена-n-0