РИТМИЧНЫЙ
type: LexicalConcept
association: http://lod.ruthes.org/resource/concept/135847
association1: http://lod.ruthes.org/resource/concept/107601
association1: http://lod.ruthes.org/resource/concept/125068
hypernym: http://lod.ruthes.org/resource/concept/119416
hypernym: http://lod.ruthes.org/resource/concept/150752
hyponym: http://lod.ruthes.org/resource/concept/125353
hyponym: http://lod.ruthes.org/resource/concept/128651
definition: совершающийся в определённом темпе; размеренный, ритмичный
in scheme: ruthes
lexicalized sense: 120664-в такт-prepg-0
lexicalized sense: 120664-мерный-adj-0
lexicalized sense: 120664-ритмический-adj-0
lexicalized sense: 120664-ритмичность-n-0
lexicalized sense: 120664-ритмичный-adj-0