ТОРЖЕСТВОВАТЬ (ИСПЫТЫВАТЬ ТОРЖЕСТВО)
type: LexicalConcept
hypernym: http://lod.ruthes.org/resource/concept/115175
hypernym: http://lod.ruthes.org/resource/concept/118562
meronym: http://lod.ruthes.org/resource/concept/118587
definition: находиться в состоянии торжества, быть победителем по отношению к кому-чему-нибудь
in scheme: ruthes
lexicalized sense: 120767-испытывать торжество-vg-0
lexicalized sense: 120767-торжествовать-v-0