БЕЗДАРНЫЙ, НЕСПОСОБНЫЙ
type: LexicalConcept
association: http://lod.ruthes.org/resource/concept/106767
association1: http://lod.ruthes.org/resource/concept/153616
holonym: http://lod.ruthes.org/resource/concept/125199
hypernym: http://lod.ruthes.org/resource/concept/138351
definition: бесталанный; отсутствие таланта; бездарность, заурядность
in scheme: ruthes
lexicalized sense: 120825-бездарность-n-0
lexicalized sense: 120825-бездарный-adj-0
lexicalized sense: 120825-бесталанность-n-0
lexicalized sense: 120825-бесталанный-adj-0
lexicalized sense: 120825-неспособный-adj-0
lexicalized sense: 120825-неталантливость-n-0
lexicalized sense: 120825-неталантливый-adj-0