БЛАЖЕНСТВО
type: LexicalConcept
association2: http://lod.ruthes.org/resource/concept/124945
holonym: http://lod.ruthes.org/resource/concept/120849
hypernym: http://lod.ruthes.org/resource/concept/106658
definition: удовольствие, наслаждение, блаженство, упоение
in scheme: ruthes
lexicalized sense: 120848-блаженство-n-0
lexicalized sense: 120848-нега-n-0