СТОГ
type: LexicalConcept
association1: http://lod.ruthes.org/resource/concept/111820
hypernym: http://lod.ruthes.org/resource/concept/107161
hyponym: http://lod.ruthes.org/resource/concept/121016
definition: плотно уложенная куча сена или соломы, как правило, округлой формы
in scheme: ruthes
lexicalized sense: 120892-стог-n-0
lexicalized sense: 120892-стоговый-adj-0
lexicalized sense: 120892-стожок-n-0