ХРОНИЧЕСКИЙ (ДЛИТЕЛЬНЫЙ)
type: LexicalConcept
association2: http://lod.ruthes.org/resource/concept/2283
hypernym: http://lod.ruthes.org/resource/concept/114203
definition: длящийся много времени, медленно развивающийся, затяжной (о болезни)
in scheme: ruthes
lexicalized sense: 120894-хронический-adj-0