ЦЕРКОВНЫЙ ПЕВЧИЙ
type: LexicalConcept
holonym: http://lod.ruthes.org/resource/concept/147524
hypernym: http://lod.ruthes.org/resource/concept/113266
hypernym: http://lod.ruthes.org/resource/concept/114195
definition: занимающийся пением в хоре (обычно церковном)
in scheme: ruthes
lexicalized sense: 120946-певческий-adj-0
lexicalized sense: 120946-певчий-n-0
lexicalized sense: 120946-певчий хора-ng-0
lexicalized sense: 120946-церковный певчий-ng-0