НРАВОУЧЕНИЕ
type: LexicalConcept
association2: http://lod.ruthes.org/resource/concept/112541
hypernym: http://lod.ruthes.org/resource/concept/107124
hyponym: http://lod.ruthes.org/resource/concept/120993
definition: внушение нравственных правил; поучение, наставление
in scheme: ruthes
lexicalized sense: 120994-мораль-n-0
lexicalized sense: 120994-нравоучение-n-0