ВСЕНАРОДНЫЙ
type: LexicalConcept
hypernym: http://lod.ruthes.org/resource/concept/119353
definition: общий для всего народа, относящийся ко всему народу
in scheme: ruthes
lexicalized sense: 121056-всенародный-adj-0
lexicalized sense: 121056-общенародность-n-0
lexicalized sense: 121056-общенародный-adj-0