ИСЧЕРПЫВАЮЩИЙ
type: LexicalConcept
hypernym: http://lod.ruthes.org/resource/concept/118823
definition: полностью удовлетворяющий требованиям, не требующий дополнения, пояснения, углубления и т. п.; всеохватывающий, полный всесторонний
in scheme: ruthes
lexicalized sense: 121092-исчерпывающий-adj-0