ТЕЛОСЛОЖЕНИЕ
type: LexicalConcept
holonym: http://lod.ruthes.org/resource/concept/107728
hypernym: http://lod.ruthes.org/resource/concept/106559
hypernym: http://lod.ruthes.org/resource/concept/142922
hyponym: http://lod.ruthes.org/resource/concept/123381
hyponym: http://lod.ruthes.org/resource/concept/125106
hyponym: http://lod.ruthes.org/resource/concept/129234
hyponym: http://lod.ruthes.org/resource/concept/130893
hyponym: http://lod.ruthes.org/resource/concept/130894
meronym: http://lod.ruthes.org/resource/concept/150307
definition: совокупность особенностей строения, формы, величины и соотношения отдельных частей тела человека
in scheme: ruthes
lexicalized sense: 121166-комплекция-n-0
lexicalized sense: 121166-конституция тела-ng-0
lexicalized sense: 121166-конституция фигуры-ng-0
lexicalized sense: 121166-сложение-n-0
lexicalized sense: 121166-сложение тела-ng-0
lexicalized sense: 121166-телосложение-n-0
lexicalized sense: 121166-фигура-n-0
lexicalized sense: 121166-фигурка-n-0