ФЕОДАЛ
type: LexicalConcept
holonym: http://lod.ruthes.org/resource/concept/3159
hypernym: http://lod.ruthes.org/resource/concept/2149
hyponym: http://lod.ruthes.org/resource/concept/110605
hyponym: http://lod.ruthes.org/resource/concept/110606
hyponym: http://lod.ruthes.org/resource/concept/110607
hyponym: http://lod.ruthes.org/resource/concept/112551
hyponym: http://lod.ruthes.org/resource/concept/125437
hyponym: http://lod.ruthes.org/resource/concept/127437
hyponym: http://lod.ruthes.org/resource/concept/127440
hyponym: http://lod.ruthes.org/resource/concept/129705
hyponym: http://lod.ruthes.org/resource/concept/129707
hyponym: http://lod.ruthes.org/resource/concept/134779
definition: представитель господствующего класса при феодализме, владелец феода
in scheme: ruthes
lexicalized sense: 121230-феодал-n-0