НЕДОБРОСОВЕСТНЫЙ
type: LexicalConcept
association: http://lod.ruthes.org/resource/concept/118716
association2: http://lod.ruthes.org/resource/concept/146193
hypernym: http://lod.ruthes.org/resource/concept/120592
definition: нечестность или нерадивость при выполнении каки-либо обязанностей, работ итп
in scheme: ruthes
lexicalized sense: 121362-недобросовестность-n-0
lexicalized sense: 121362-недобросовестный-adj-0