СГЛАЗ, ПОРЧА
type: LexicalConcept
association2: http://lod.ruthes.org/resource/concept/153209
holonym: http://lod.ruthes.org/resource/concept/113539
hypernym: http://lod.ruthes.org/resource/concept/106548
hypernym: http://lod.ruthes.org/resource/concept/126176
definition: по суеверным представлениям — вред, якобы причиняемый кому-либо магическим путём
in scheme: ruthes
lexicalized sense: 121366-дурной глаз-ng-0
lexicalized sense: 121366-наведение порчи-ng-0
lexicalized sense: 121366-навести порчу-vg-0
lexicalized sense: 121366-наводить порчу-vg-0
lexicalized sense: 121366-напустить порчу-vg-0
lexicalized sense: 121366-наслать порчу-vg-0
lexicalized sense: 121366-насылать порчу-vg-0
lexicalized sense: 121366-порча-n-0
lexicalized sense: 121366-сглаз-n-0
lexicalized sense: 121366-сглазить-v-0