ПОСЛЕДНИЙ ПО ПОРЯДКУ
type: LexicalConcept
association2: http://lod.ruthes.org/resource/concept/153769
hypernym: http://lod.ruthes.org/resource/concept/150652
hyponym: http://lod.ruthes.org/resource/concept/118846
hyponym: http://lod.ruthes.org/resource/concept/131350
definition: последний, завершающий, связанный с концом чего-либо
in scheme: ruthes
lexicalized sense: 121477-конечный-adj-0
lexicalized sense: 121477-конечный в ряду-adjg-0
lexicalized sense: 121477-последний-adj-0
lexicalized sense: 121477-последний в ряду-adjg-0
lexicalized sense: 121477-последний по порядку-adjg-0