СВИДЕТЕЛЬСТВО, СЕРТИФИКАТ
type: LexicalConcept
holonym: http://lod.ruthes.org/resource/concept/3049
hypernym: http://lod.ruthes.org/resource/concept/107000
hyponym: http://lod.ruthes.org/resource/concept/106997
hyponym: http://lod.ruthes.org/resource/concept/110104
hyponym: http://lod.ruthes.org/resource/concept/1409
hyponym: http://lod.ruthes.org/resource/concept/4122
hyponym: http://lod.ruthes.org/resource/concept/6420
hyponym: http://lod.ruthes.org/resource/concept/6560
definition: документ, удостоверяющий что-либо; удостоверение
in scheme: ruthes
lexicalized sense: 121677-свидетельство-n-0
lexicalized sense: 121677-сертификат-n-0
lexicalized sense: 121677-сертификатный-adj-0