БРИГАДА (ТРУДОВОЙ КОЛЛЕКТИВ)
type: LexicalConcept
hypernym: http://lod.ruthes.org/resource/concept/879
hyponym: http://lod.ruthes.org/resource/concept/5557
hyponym: http://lod.ruthes.org/resource/concept/7185
hyponym: http://lod.ruthes.org/resource/concept/7186
meronym: http://lod.ruthes.org/resource/concept/121720
definition: группа лиц, выполняющая определенный комплекс работ
in scheme: ruthes
lexicalized sense: 121719-бригада-n-0
lexicalized sense: 121719-бригадный-adj-0